BDBM35094 biarylether alcohol quinoline, 5f
SMILES Cc1cnc2c(cccc2c1-c1cccc(Oc2cccc(CO)c2)c1)C(F)(F)F
InChI Key InChIKey=CQEKMSRTDPXHST-UHFFFAOYSA-N
Data  4 IC50  1 EC50
  Tab Delimited (TSV)   2D SDfile   Computed 3D by Vconf -m prep SDfile
Find this compound or compounds like it in BindingDB:
Activity Spreadsheet -- Enzyme Inhibition Constant Data from BindingDB
Found 1 hit for monomerid = 35094
TargetOxysterols receptor LXR-alpha(Homo sapiens (Human))
Wyeth Pharmaceuticals
Curated by ChEMBL
LigandPNGBDBM35094(biarylether alcohol quinoline, 5f)
Affinity DataIC50:  3nM. Assay description: Displacement of [3H]T0901317 from human recombinant LXRalpha-LBD
In DepthDetails ArticlePubMed